Reaction Details
TargetBeta-adrenergic receptor kinase 2
LigandBDBM50566947
Substrate/Competitorn/a
Meas. Tech.ChEMBL_2102045 (CHEMBL4810441)
IC50>10000±n/a nM
Citation Uehling, DEJoseph, BChung, KCZhang, AXLer, SPrakesch, MAPoda, GGrouleff, JAman, AKiyota, TLeung-Hagesteijn, CKonda, JDMarcellus, RGriffin, CSubramaniam, RAbibi, AStrathdee, CAIsaac, MBAl-Awar, RTiedemann, RE Design, Synthesis, and Characterization of 4-Aminoquinazolines as Potent Inhibitors of the G Protein-Coupled Receptor Kinase 6 (GRK6) for the Treatment of Multiple Myeloma. J Med Chem64:11129-11147 (2021) 
 
Beta-adrenergic receptor kinase 2
Name:Beta-adrenergic receptor kinase 2
Type:PROTEIN
Mol. Mass.:79721.92
Organism:Homo sapiens (Human)
Description:ChEMBL_615172
Residue:688
BDBM50566947
NameBDBM50566947
Synonyms:CHEMBL4847703
TypeSmall organic molecule
Emp. Form.C20H20FN7O
Mol. Mass.393.4175
SMILESCCc1cc(Nc2nc(NCc3ccc(F)cn3)nc3cccc(OC)c23)n[nH]1