Reaction Details
TargetPeroxisome proliferator-activated receptor delta
LigandBDBM28681
Substrate/Competitorn/a
Meas. Tech.ChEMBL_153883 (CHEMBL759405)
IC50>50000±n/a nM
Citation Desai, RCHan, WMetzger, EJBergman, JPGratale, DFMacNaul, KLBerger, JPDoebber, TWLeung, KMoller, DEHeck, JVSahoo, SP 5-aryl thiazolidine-2,4-diones: discovery of PPAR dual alpha/gamma agonists as antidiabetic agents. Bioorg Med Chem Lett13:2795-8 (2003) Peroxisome proliferator-activated receptor delta
Name:Peroxisome proliferator-activated receptor delta
Type:Enzyme
Mol. Mass.:49910.45
Organism:Homo sapiens (Human)
Description:Q03181
Residue:441
BDBM28681
NameBDBM28681
Synonyms:5-[(4-{2-[methyl(pyridin-2-yl)amino]ethoxy}phenyl)methyl]-1,3-thiazolidine-2,4-dione BRL 49653 CHEMBL121 [3H]rosiglitazone rosiglitazone
Typeradiolabeled ligand
Emp. Form.C18H19N3O3S
Mol. Mass.357.427
SMILESCN(CCOc1ccc(Cc2sc(=O)[nH]c2O)cc1)c1ccccn1