Reaction Details
TargetPeroxisome proliferator-activated receptor gamma
LigandBDBM28681
Substrate/Competitorn/a
Meas. Tech.ChEMBL_154207 (CHEMBL759452)
IC50 250±n/a nM
Citation Desai, RCHan, WMetzger, EJBergman, JPGratale, DFMacNaul, KLBerger, JPDoebber, TWLeung, KMoller, DEHeck, JVSahoo, SP 5-aryl thiazolidine-2,4-diones: discovery of PPAR dual alpha/gamma agonists as antidiabetic agents. Bioorg Med Chem Lett13:2795-8 (2003) Peroxisome proliferator-activated receptor gamma
Name:Peroxisome proliferator-activated receptor gamma
Type:Nuclear Receptor
Mol. Mass.:57613.46
Organism:Homo sapiens (Human)
Description:P37231
Residue:505
BDBM28681
NameBDBM28681
Synonyms:5-[(4-{2-[methyl(pyridin-2-yl)amino]ethoxy}phenyl)methyl]-1,3-thiazolidine-2,4-dione BRL 49653 CHEMBL121 [3H]rosiglitazone rosiglitazone
Typeradiolabeled ligand
Emp. Form.C18H19N3O3S
Mol. Mass.357.427
SMILESCN(CCOc1ccc(Cc2sc(=O)[nH]c2O)cc1)c1ccccn1