Reaction Details
TargetHomeodomain-interacting protein kinase 2
LigandBDBM50567047
Substrate/Competitorn/a
Meas. Tech.ChEMBL_2102252 (CHEMBL4810648)
Kd 1200±n/a nM
Citation Henderson, SHSorrell, FBennett, JFedorov, OHanley, MTGodoi, PHRuela de Sousa, RRobinson, SAshall-Kelly, AHopkins Navratilova, IWalter, DSElkins, JMWard, SE Discovery and Characterization of Selective and Ligand-Efficient DYRK Inhibitors. J Med Chem64:11709-11728 (2021) 
 
Homeodomain-interacting protein kinase 2
Name:Homeodomain-interacting protein kinase 2
Type:Protein
Mol. Mass.:131001.90
Organism:Homo sapiens (Human)
Description:Q9H2X6
Residue:1198
BDBM50567047
NameBDBM50567047
Synonyms:CHEMBL4848254
TypeSmall organic molecule
Emp. Form.C12H12N6
Mol. Mass.240.2639
SMILESCN(C)c1nccc(n1)-c1cnn2ncccc12