Reaction Details
Target5-hydroxytryptamine receptor 1A
LigandBDBM50122239
Substrate/Competitorn/a
Meas. Tech.ChEMBL_1120 (CHEMBL616065)
Ki 2.54±n/a nM
Citation Betti, LCorelli, FFloridi, MGiannaccini, GMaccari, LManetti, FStrappaghetti, GBotta, M Alpha1-adrenoceptor antagonists. 6. Structural optimization of pyridazinone-arylpiperazines. Study of the influence on affinity and selectivity of cyclic substituents at the pyridazinone ring and alkoxy groups at the arylpiperazine moiety. J Med Chem46:3555-8 (2003) 
 
5-hydroxytryptamine receptor 1A
Name:5-hydroxytryptamine receptor 1A
Type:G Protein-Coupled Receptor (GPCR)
Mol. Mass.:46445.29
Organism:Rattus norvegicus (rat)
Description:Binding assays were performed using rat hippocampal membranes.
Residue:422
BDBM50122239
NameBDBM50122239
Synonyms:4-Chloro-5-{4-[2-(2-ethoxy-phenoxy)-ethyl]-piperazin-1-yl}-2-{7-[4-(2-isopropoxy-phenyl)-piperazin-1-yl]-heptyl}-2H-pyridazin-3-one CHEMBL300093
TypeSmall organic molecule
Emp. Form.C38H55ClN6O4
Mol. Mass.695.334
SMILESCCOc1ccccc1OCCN1CCN(CC1)c1cnn(CCCCCCCN2CCN(CC2)c2ccccc2OC(C)C)c(=O)c1Cl