Reaction Details
TargetMitogen-activated protein kinase 8
LigandBDBM50567686
Substrate/Competitorn/a
Meas. Tech.ChEMBL_2103763 (CHEMBL4812266)
Kd 210±n/a nM
Citation Pfaffenrot, BKlövekorn, PJuchum, MSelig, RAlbrecht, WZender, LLaufer, SA Design and synthesis of 1H-pyrazolo[3,4-b]pyridines targeting mitogen-activated protein kinase kinase 4 (MKK4) - A promising target for liver regeneration. Eur J Med Chem218:0 (2021) 
 
Mitogen-activated protein kinase 8
Name:Mitogen-activated protein kinase 8
Type:Enzyme
Mol. Mass.:48297.57
Organism:Homo sapiens (Human)
Description:JNK-1 was purchased from Upstate Cell Signaling Solutions (formerly Upstate Biotechnology).
Residue:427
BDBM50567686
NameBDBM50567686
Synonyms:CHEMBL4798975
TypeSmall organic molecule
Emp. Form.C26H19F2N5O5S2
Mol. Mass.583.586
SMILESNS(=O)(=O)c1ccc(cc1)-c1cnc2[nH]nc(C(=O)c3c(F)ccc(NS(=O)(=O)Cc4ccccc4)c3F)c2c1