Reaction Details
TargetAminopeptidase N
LigandBDBM50132083
Substrate/Competitorn/a
Meas. Tech.ChEMBL_35511 (CHEMBL644744)
IC50 25000±n/a nM
Citation Bauvois, BPuiffe, MLBongui, JBPaillat, SMonneret, CDauzonne, D Synthesis and biological evaluation of novel flavone-8-acetic acid derivatives as reversible inhibitors of aminopeptidase N/CD13. J Med Chem46:3900-13 (2003) 
 
Aminopeptidase N
Name:Aminopeptidase N
Type:Protein
Mol. Mass.:108810.25
Organism:Sus scrofa (Pig)
Description:P15145
Residue:963
BDBM50132083
NameBDBM50132083
Synonyms:CHEMBL125622 | [3-Nitro-2-(2-nitro-phenyl)-4-oxo-4H-chromen-8-yl]-acetic acid
TypeSmall organic molecule
Emp. Form.C17H10N2O8
Mol. Mass.370.2699
SMILESOC(=O)Cc1cccc2c1oc(-c1ccccc1[N+]([O-])=O)c([N+]([O-])=O)c2=O