Reaction Details
Target5-hydroxytryptamine receptor 5A
LigandBDBM50132095
Substrate/Competitorn/a
Meas. Tech.ChEMBL_3595 (CHEMBL618080)
Ki 875±n/a nM
Citation Khorana, NSmith, CHerrick-Davis, KPurohit, ATeitler, MGrella, BDukat, MGlennon, RA Binding of tetrahydrocarboline derivatives at human 5-HT5A receptors. J Med Chem46:3930-7 (2003) 
 
5-hydroxytryptamine receptor 5A
Name:5-hydroxytryptamine receptor 5A
Type:Enzyme Catalytic Domain
Mol. Mass.:40749.33
Organism:MOUSE
Description:5-HT5 0 MOUSE::P30966
Residue:357
BDBM50132095
NameBDBM50132095
Synonyms:5-Benzyl-2-(3-phenoxy-propyl)-2,3,4,5-tetrahydro-1H-pyrido[4,3-b]indole | CHEMBL130586
TypeSmall organic molecule
Emp. Form.C27H28N2O
Mol. Mass.396.524
SMILESC(COc1ccccc1)CN1CCc2c(C1)c1ccccc1n2Cc1ccccc1