Reaction Details
Target5-hydroxytryptamine receptor 2A
LigandBDBM50409726
Substrate/Competitorn/a
Meas. Tech.ChEMBL_2646 (CHEMBL618895)
Ki 120±n/a nM
Citation Khorana, NSmith, CHerrick-Davis, KPurohit, ATeitler, MGrella, BDukat, MGlennon, RA Binding of tetrahydrocarboline derivatives at human 5-HT5A receptors. J Med Chem46:3930-7 (2003) 
 
5-hydroxytryptamine receptor 2A
Name:5-hydroxytryptamine receptor 2A
Type:G Protein-Coupled Receptor (GPCR)
Mol. Mass.:52852.05
Organism:Rattus norvegicus (rat)
Description:Rat cortex membranes 5-HT2A receptors.
Residue:471
BDBM50409726
NameBDBM50409726
Synonyms:CHEMBL2111848
TypeSmall organic molecule
Emp. Form.C23H26N2
Mol. Mass.330.4659
SMILESCn1c2CCN(C\C=C/CCc3ccccc3)Cc2c2ccccc12