Reaction Details
Target5-hydroxytryptamine receptor 2A
LigandBDBM50132086
Substrate/Competitorn/a
Meas. Tech.ChEMBL_2646 (CHEMBL618895)
Ki 20±n/a nM
Citation Khorana, NSmith, CHerrick-Davis, KPurohit, ATeitler, MGrella, BDukat, MGlennon, RA Binding of tetrahydrocarboline derivatives at human 5-HT5A receptors. J Med Chem46:3930-7 (2003) 
 
5-hydroxytryptamine receptor 2A
Name:5-hydroxytryptamine receptor 2A
Type:G Protein-Coupled Receptor (GPCR)
Mol. Mass.:52852.05
Organism:Rattus norvegicus (rat)
Description:Rat cortex membranes 5-HT2A receptors.
Residue:471
BDBM50132086
NameBDBM50132086
Synonyms:2-(3-Phenoxy-propyl)-2,3,4,5-tetrahydro-1H-pyrido[4,3-b]indole | CHEMBL126438
TypeSmall organic molecule
Emp. Form.C20H22N2O
Mol. Mass.306.4015
SMILESC(COc1ccccc1)CN1CCc2[nH]c3ccccc3c2C1