Reaction Details
Target5-hydroxytryptamine receptor 2A
LigandBDBM50132093
Substrate/Competitorn/a
Meas. Tech.ChEMBL_2646 (CHEMBL618895)
Ki 185±n/a nM
Citation Khorana, NSmith, CHerrick-Davis, KPurohit, ATeitler, MGrella, BDukat, MGlennon, RA Binding of tetrahydrocarboline derivatives at human 5-HT5A receptors. J Med Chem46:3930-7 (2003) 
 
5-hydroxytryptamine receptor 2A
Name:5-hydroxytryptamine receptor 2A
Type:G Protein-Coupled Receptor (GPCR)
Mol. Mass.:52852.05
Organism:Rattus norvegicus (rat)
Description:Rat cortex membranes 5-HT2A receptors.
Residue:471
BDBM50132093
NameBDBM50132093
Synonyms:5-Methyl-2-(6-phenyl-hexyl)-2,3,4,5-tetrahydro-1H-pyrido[4,3-b]indole | CHEMBL125361
TypeSmall organic molecule
Emp. Form.C24H30N2
Mol. Mass.346.5084
SMILESCn1c2CCN(CCCCCCc3ccccc3)Cc2c2ccccc12