Reaction Details
Target5-hydroxytryptamine receptor 2A
LigandBDBM50132094
Substrate/Competitorn/a
Meas. Tech.ChEMBL_2646 (CHEMBL618895)
Ki 160±n/a nM
Citation Khorana, NSmith, CHerrick-Davis, KPurohit, ATeitler, MGrella, BDukat, MGlennon, RA Binding of tetrahydrocarboline derivatives at human 5-HT5A receptors. J Med Chem46:3930-7 (2003) 
 
5-hydroxytryptamine receptor 2A
Name:5-hydroxytryptamine receptor 2A
Type:G Protein-Coupled Receptor (GPCR)
Mol. Mass.:52852.05
Organism:Rattus norvegicus (rat)
Description:Rat cortex membranes 5-HT2A receptors.
Residue:471
BDBM50132094
NameBDBM50132094
Synonyms:1-(4-Fluoro-phenyl)-4-(5-methyl-1,3,4,5-tetrahydro-pyrido[4,3-b]indol-2-yl)-butan-1-ol | CHEMBL338696
TypeSmall organic molecule
Emp. Form.C22H25FN2O
Mol. Mass.352.4451
SMILESCn1c2CCN(CCCC(O)c3ccc(F)cc3)Cc2c2ccccc12