Reaction Details
Target5-hydroxytryptamine receptor 5A
LigandBDBM50130265
Substrate/Competitorn/a
Meas. Tech.ChEMBL_3584 (CHEMBL620717)
Ki 55±n/a nM
Citation Khorana, NSmith, CHerrick-Davis, KPurohit, ATeitler, MGrella, BDukat, MGlennon, RA Binding of tetrahydrocarboline derivatives at human 5-HT5A receptors. J Med Chem46:3930-7 (2003) 
 
5-hydroxytryptamine receptor 5A
Name:5-hydroxytryptamine receptor 5A
Type:Enzyme
Mol. Mass.:40266.25
Organism:Homo sapiens (Human)
Description:P47898
Residue:357
BDBM50130265
NameBDBM50130265
Synonyms:2-[3-(4-Fluoro-phenoxy)-propyl]-5-methyl-2,3,4,5-tetrahydro-1H-pyrido[4,3-b]indole | CHEMBL96504
TypeSmall organic molecule
Emp. Form.C21H23FN2O
Mol. Mass.338.4185
SMILESCn1c2CCN(CCCOc3ccc(F)cc3)Cc2c2ccccc12