Reaction Details
Target5-hydroxytryptamine receptor 2C
LigandBDBM50132089
Substrate/Competitorn/a
Meas. Tech.ChEMBL_2829 (CHEMBL621515)
Ki 245±n/a nM
Citation Khorana, NSmith, CHerrick-Davis, KPurohit, ATeitler, MGrella, BDukat, MGlennon, RA Binding of tetrahydrocarboline derivatives at human 5-HT5A receptors. J Med Chem46:3930-7 (2003) 
 
5-hydroxytryptamine receptor 2C
Name:5-hydroxytryptamine receptor 2C
Type:Enzyme
Mol. Mass.:51935.10
Organism:Rattus norvegicus (Rat)
Description:P08909
Residue:460
BDBM50132089
NameBDBM50132089
Synonyms:5-Methyl-2-(5-phenyl-pent-2-enyl)-2,3,4,5-tetrahydro-1H-pyrido[4,3-b]indole | CHEMBL446356
TypeSmall organic molecule
Emp. Form.C23H26N2
Mol. Mass.330.4659
SMILESCn1c2CCN(C\C=C\CCc3ccccc3)Cc2c2ccccc12