Reaction Details
Target5-hydroxytryptamine receptor 2C
LigandBDBM50132111
Substrate/Competitorn/a
Meas. Tech.ChEMBL_2829 (CHEMBL621515)
Ki 60±n/a nM
Citation Khorana, NSmith, CHerrick-Davis, KPurohit, ATeitler, MGrella, BDukat, MGlennon, RA Binding of tetrahydrocarboline derivatives at human 5-HT5A receptors. J Med Chem46:3930-7 (2003) 
 
5-hydroxytryptamine receptor 2C
Name:5-hydroxytryptamine receptor 2C
Type:Enzyme
Mol. Mass.:51935.10
Organism:Rattus norvegicus (Rat)
Description:P08909
Residue:460
BDBM50132111
NameBDBM50132111
Synonyms:1-(4-Fluoro-phenyl)-4-(5-methyl-1,3,4,5-tetrahydro-pyrido[4,3-b]indol-2-yl)-butan-1-one | CHEMBL129230
TypeSmall organic molecule
Emp. Form.C22H23FN2O
Mol. Mass.350.4292
SMILESCn1c2CCN(CCCC(=O)c3ccc(F)cc3)Cc2c2ccccc12