Reaction Details
Target5-hydroxytryptamine receptor 5A
LigandBDBM50132096
Substrate/Competitorn/a
Meas. Tech.ChEMBL_3584 (CHEMBL620717)
Ki 100±n/a nM
Citation Khorana, NSmith, CHerrick-Davis, KPurohit, ATeitler, MGrella, BDukat, MGlennon, RA Binding of tetrahydrocarboline derivatives at human 5-HT5A receptors. J Med Chem46:3930-7 (2003) 
 
5-hydroxytryptamine receptor 5A
Name:5-hydroxytryptamine receptor 5A
Type:Enzyme
Mol. Mass.:40266.25
Organism:Homo sapiens (Human)
Description:P47898
Residue:357
BDBM50132096
NameBDBM50132096
Synonyms:5-Ethyl-2-(3-phenoxy-propyl)-2,3,4,5-tetrahydro-1H-pyrido[4,3-b]indole | CHEMBL128099
TypeSmall organic molecule
Emp. Form.C22H26N2O
Mol. Mass.334.4546
SMILESCCn1c2CCN(CCCOc3ccccc3)Cc2c2ccccc12