Reaction Details
TargetCyclin-dependent kinase 1/G2/mitotic-specific cyclin-B1/G2/mitotic-specific cyclin-B2/G2/mitotic-specific cyclin-B3
LigandBDBM50132184
Substrate/Competitorn/a
Meas. Tech.ChEMBL_50496 (CHEMBL661113)
IC50 17000±n/a nM
Citation Moravcová, DKrystof, VHavlícek, LMoravec, JLenobel, RStrnad, M Pyrazolo[4,3-d]pyrimidines as new generation of cyclin-dependent kinase inhibitors. Bioorg Med Chem Lett13:2989-92 (2003) Cyclin-dependent kinase 1/G2/mitotic-specific cyclin-B1/G2/mitotic-specific cyclin-B2/G2/mitotic-specific cyclin-B3
Name:Cyclin-dependent kinase 1/G2/mitotic-specific cyclin-B1/G2/mitotic-specific cyclin-B2/G2/mitotic-specific cyclin-B3
Type:n/a
Mol. Mass.:n/a
Description:ASSAY_ID of EBI is 40085
Components:This complex has 4 components.
Component 1
Name:G2/mitotic-specific cyclin-B3
Synonyms:CCNB3 CYCB3 G2/mitotic-specific cyclin-B3
Type:PROTEIN
Mol. Mass.:157916.84
Organism:Homo sapiens (Human)
Description:n/a
Residue:1395
Component 2
Name:G2/mitotic-specific cyclin-B1
Synonyms:CCNB CCNB1_HUMAN
Type:Enzyme Subunit
Mol. Mass.:48340.95
Organism:Homo sapiens (Human)
Description:P14635
Residue:433
Component 3
Name:G2/mitotic-specific cyclin-B2
Synonyms:CCNB2 Cyclin-dependent kinase 1/cyclin B | G2/mitotic-specific cyclin-B2
Type:PROTEIN
Mol. Mass.:45293.13
Organism:Homo sapiens (Human)
Description:n/a
Residue:398
Component 4
Name:Cyclin-dependent kinase 1
Synonyms:CDC2 CDK1 CDKN1 Cell division protein kinase 1 P34CDC2 | p34 protein kinase
Type:Enzyme Subunit
Mol. Mass.:34101.08
Organism:Homo sapiens (Human)
Description:P06493
Residue:297
BDBM50132184
NameBDBM50132184
Synonyms:(9-Isopropyl-9H-purin-6-yl)-(3-methyl-but-2-enyl)-amine | CHEMBL316572
TypeSmall organic molecule
Emp. Form.C13H19N5
Mol. Mass.245.3235
SMILES[#6]-[#6](-[#6])-n1cnc2c(-[#7]-[#6]\[#6]=[#6](/[#6])-[#6])ncnc12