Reaction Details
TargetPlatelet-derived growth factor receptor beta
LigandBDBM50132202
Substrate/Competitorn/a
Meas. Tech.ChEBML_158518
IC50>750±n/a nM
Citation Matsuno, KSeishi, TNakajima, TIchimura, MGiese, NAYu, JCOda, SNomoto, Y Potent and selective inhibitors of platelet-derived growth factor receptor phosphorylation. Part 4: structure-activity relationships for substituents on the quinazoline moiety of 4-[4-(N-substituted(thio)carbamoyl)-1-piperazinyl]-6,7-dimethoxyquinazoline derivatives. Bioorg Med Chem Lett13:3001-4 (2003) Platelet-derived growth factor receptor beta
Name:Platelet-derived growth factor receptor beta
Type:Enzyme
Mol. Mass.:123922.25
Organism:Homo sapiens (Human)
Description:P09619
Residue:1106
BDBM50132202
NameBDBM50132202
Synonyms:4-[4-(4-Phenoxy-phenylcarbamoyl)-piperazin-1-yl]-quinazoline-7-carboxylic acid methyl ester | CHEMBL100982
TypeSmall organic molecule
Emp. Form.C27H25N5O4
Mol. Mass.483.5185
SMILESCOC(=O)c1ccc2c(ncnc2c1)N1CCN(CC1)C(=O)Nc1ccc(Oc2ccccc2)cc1