Reaction Details
TargetPlatelet-derived growth factor receptor beta
LigandBDBM50132206
Substrate/Competitorn/a
Meas. Tech.ChEBML_158518
IC50 40.0±n/a nM
Citation Matsuno, KSeishi, TNakajima, TIchimura, MGiese, NAYu, JCOda, SNomoto, Y Potent and selective inhibitors of platelet-derived growth factor receptor phosphorylation. Part 4: structure-activity relationships for substituents on the quinazoline moiety of 4-[4-(N-substituted(thio)carbamoyl)-1-piperazinyl]-6,7-dimethoxyquinazoline derivatives. Bioorg Med Chem Lett13:3001-4 (2003) Platelet-derived growth factor receptor beta
Name:Platelet-derived growth factor receptor beta
Type:Enzyme
Mol. Mass.:123922.25
Organism:Homo sapiens (Human)
Description:P09619
Residue:1106
BDBM50132206
NameBDBM50132206
Synonyms:4-(6-Ethoxy-7-methoxy-quinazolin-4-yl)-piperazine-1-carboxylic acid (4-phenoxy-phenyl)-amide | CHEMBL100736
TypeSmall organic molecule
Emp. Form.C28H29N5O4
Mol. Mass.499.561
SMILESCCOc1cc2c(ncnc2cc1OC)N1CCN(CC1)C(=O)Nc1ccc(Oc2ccccc2)cc1