Reaction Details
TargetPlatelet-derived growth factor receptor beta
LigandBDBM50132212
Substrate/Competitorn/a
Meas. Tech.ChEBML_158518
IC50 970±n/a nM
Citation Matsuno, KSeishi, TNakajima, TIchimura, MGiese, NAYu, JCOda, SNomoto, Y Potent and selective inhibitors of platelet-derived growth factor receptor phosphorylation. Part 4: structure-activity relationships for substituents on the quinazoline moiety of 4-[4-(N-substituted(thio)carbamoyl)-1-piperazinyl]-6,7-dimethoxyquinazoline derivatives. Bioorg Med Chem Lett13:3001-4 (2003) Platelet-derived growth factor receptor beta
Name:Platelet-derived growth factor receptor beta
Type:Enzyme
Mol. Mass.:123922.25
Organism:Homo sapiens (Human)
Description:P09619
Residue:1106
BDBM50132212
NameBDBM50132212
Synonyms:4-(6,7-Difluoro-quinazolin-4-yl)-piperazine-1-carboxylic acid (4-phenoxy-phenyl)-amide | CHEMBL100523
TypeSmall organic molecule
Emp. Form.C25H21F2N5O2
Mol. Mass.461.4633
SMILESFc1cc2ncnc(N3CCN(CC3)C(=O)Nc3ccc(Oc4ccccc4)cc3)c2cc1F