Reaction Details
TargetProtein kinase C alpha type
LigandBDBM50097751
Substrate/Competitorn/a
Meas. Tech.ChEMBL_160449 (CHEMBL762480)
Ki>10000±n/a nM
Citation Nakagawa, YIrie, KYamanaka, NOhigashi, HTsuda, K Synthesis and binding selectivity of 7- and 15-decylbenzolactone-V8 for the C1 domains of protein kinase C isozymes. Bioorg Med Chem Lett13:3015-9 (2003) Protein kinase C alpha type
Name:Protein kinase C alpha type
Type:Enzyme
Mol. Mass.:76755.65
Organism:Homo sapiens (Human)
Description:The recombinant human PKC enzymes were produced using a baculovirus expression system in SF9 cells
Residue:672
BDBM50097751
NameBDBM50097751
Synonyms:(2S,5S)-8-Decyl-5-hydroxymethyl-2-isopropyl-1-methyl-1,2,5,6-tetrahydro-benzo[e][1,4]oxazocin-3-one CHEMBL318971
TypeSmall organic molecule
Emp. Form.C25H41NO3
Mol. Mass.403.5979
SMILESCCCCCCCCCCc1ccc2N(C)[C@@H](C(C)C)C(=O)O[C@H](CO)Cc2c1