Reaction Details
TargetProtein kinase C theta type
LigandBDBM50132247
Substrate/Competitorn/a
Meas. Tech.ChEBML_161453
Ki 358±n/a nM
Citation Nakagawa, YIrie, KYamanaka, NOhigashi, HTsuda, K Synthesis and binding selectivity of 7- and 15-decylbenzolactone-V8 for the C1 domains of protein kinase C isozymes. Bioorg Med Chem Lett13:3015-9 (2003) Protein kinase C theta type
Name:Protein kinase C theta type
Type:Serine/threonine-protein kinase
Mol. Mass.:81878.04
Organism:Homo sapiens (Human)
Description:Full-length human PKC theta (Panvera Catalog No. P2996).
Residue:706
BDBM50132247
NameBDBM50132247
Synonyms:5-Hydroxymethyl-2-isopropyl-1-undecyl-1,2,5,6-tetrahydro-benzo[e][1,4]oxazocin-3-one | CHEMBL102991
TypeSmall organic molecule
Emp. Form.C25H41NO3
Mol. Mass.403.5979
SMILESCCCCCCCCCCCN1[C@@H](C(C)C)C(=O)O[C@H](CO)Cc2ccccc12