Reaction Details
TargetMitogen-activated protein kinase 1/3
LigandBDBM28123
Substrate/Competitorn/a
Meas. Tech.ChEMBL_99372 (CHEMBL709032)
IC50 0.010000±n/a nM
Citation Berger, DDutia, MPowell, DWu, BWissner, ABoschelli, DHFloyd, MBZhang, NTorres, NLevin, JDu, XWojciechowicz, DDiscafani, CKohler, CKim, SCFeldberg, LRCollins, KMallon, R Synthesis and evaluation of 4-anilino-6,7-dialkoxy-3-quinolinecarbonitriles as inhibitors of kinases of the Ras-MAPK signaling cascade. Bioorg Med Chem Lett13:3031-4 (2003) Mitogen-activated protein kinase 1/3
Name:Mitogen-activated protein kinase 1/3
Type:n/a
Mol. Mass.:n/a
Description:ASSAY_ID of ChEMBL is 124147
Components:This complex has 2 components.
Component 1
Name:Mitogen-activated protein kinase 1
Synonyms:ERK2 Extracellular signal-regulated kinase 2 Extracellular signal-regulated kinase 2 (ERK2) MAPK 2 MK01_HUMAN Mitogen-activated protein kinase 1 (ERK-2) Mitogen-activated protein kinase 2 PRKM2 | p42-MAPK
Type:Ser/Thr Protein Kinase
Mol. Mass.:41392.76
Organism:Homo sapiens (Human)
Description:P28482
Residue:360
Component 2
Name:Mitogen-activated protein kinase 3
Synonyms:ERK1 Extracellular signal-regulated kinase 1 MAP kinase ERK1 MAPK3/MAPK7 Mitogen-activated protein kinase PRKM3
Type:Protein
Mol. Mass.:43136.58
Organism:Homo sapiens (Human)
Description:curated by PDB 4QTB
Residue:379
BDBM28123
NameBDBM28123
Synonyms:3-cyanoquinoline, 8 CHEMBL318804
TypeSmall organic molecule
Emp. Form.C28H29ClN6O3S
Mol. Mass.565.086
SMILESCOc1cc2c(Nc3ccc(Sc4nccn4C)c(Cl)c3)c(cnc2cc1OCCCN1CCOCC1)C#N