Reaction Details
TargetDual specificity mitogen-activated protein kinase kinase 1
LigandBDBM28118
Substrate/Competitorn/a
Meas. Tech.ChEBML_124004
IC50 3±n/a nM
Citation Berger, DDutia, MPowell, DWu, BWissner, ABoschelli, DHFloyd, MBZhang, NTorres, NLevin, JDu, XWojciechowicz, DDiscafani, CKohler, CKim, SCFeldberg, LRCollins, KMallon, R Synthesis and evaluation of 4-anilino-6,7-dialkoxy-3-quinolinecarbonitriles as inhibitors of kinases of the Ras-MAPK signaling cascade. Bioorg Med Chem Lett13:3031-4 (2003) Dual specificity mitogen-activated protein kinase kinase 1
Name:Dual specificity mitogen-activated protein kinase kinase 1
Type:Other Protein Type
Mol. Mass.:43439.03
Organism:Homo sapiens (Human)
Description:Full-length human MEK-1 was generated by PCR and purified as a fusion protein from Escherichia coli lysates.
Residue:393
BDBM28118
NameBDBM28118
Synonyms:3-cyanoquinoline, 3 CHEMBL103045
TypeSmall organic molecule
Emp. Form.C30H34ClN7O2S
Mol. Mass.592.155
SMILESCCN1CCN(CCCOc2cc3ncc(C#N)c(Nc4ccc(Sc5nccn5C)c(Cl)c4)c3cc2OC)CC1