Reaction Details
TargetDual specificity mitogen-activated protein kinase kinase 1
LigandBDBM28123
Substrate/Competitorn/a
Meas. Tech.ChEBML_124004
IC50 2.00±n/a nM
Citation Berger, DDutia, MPowell, DWu, BWissner, ABoschelli, DHFloyd, MBZhang, NTorres, NLevin, JDu, XWojciechowicz, DDiscafani, CKohler, CKim, SCFeldberg, LRCollins, KMallon, R Synthesis and evaluation of 4-anilino-6,7-dialkoxy-3-quinolinecarbonitriles as inhibitors of kinases of the Ras-MAPK signaling cascade. Bioorg Med Chem Lett13:3031-4 (2003) Dual specificity mitogen-activated protein kinase kinase 1
Name:Dual specificity mitogen-activated protein kinase kinase 1
Type:Other Protein Type
Mol. Mass.:43439.03
Organism:Homo sapiens (Human)
Description:Full-length human MEK-1 was generated by PCR and purified as a fusion protein from Escherichia coli lysates.
Residue:393
BDBM28123
NameBDBM28123
Synonyms:3-cyanoquinoline, 8 CHEMBL318804
TypeSmall organic molecule
Emp. Form.C28H29ClN6O3S
Mol. Mass.565.086
SMILESCOc1cc2c(Nc3ccc(Sc4nccn4C)c(Cl)c3)c(cnc2cc1OCCCN1CCOCC1)C#N