Reaction Details
TargetCannabinoid receptor 1
LigandBDBM50132714
Substrate/Competitorn/a
Meas. Tech.ChEBML_46474
IC50 304±n/a nM
Citation Segall, YQuistad, GBNomura, DKCasida, JE Arachidonylsulfonyl derivatives as cannabinoid CB1 receptor and fatty acid amide hydrolase inhibitors. Bioorg Med Chem Lett13:3301-3 (2003) Cannabinoid receptor 1
Name:Cannabinoid receptor 1
Type:Enzyme
Mol. Mass.:52842.52
Organism:Mus musculus (Mouse)
Description:P47746
Residue:473
BDBM50132714
NameBDBM50132714
Synonyms:(5Z,8Z,11Z,14Z)-Icosa-5,8,11,14-tetraenesulfonyl fluoride | CHEMBL112486
TypeSmall organic molecule
Emp. Form.C20H33FO2S
Mol. Mass.356.538
SMILESCCCCC\C=C/C\C=C/C\C=C/C\C=C/CCCCS(F)(=O)=O