Reaction Details
TargetFatty-acid amide hydrolase 1
LigandBDBM50132715
Substrate/Competitorn/a
Meas. Tech.ChEBML_68778
IC50 2±n/a nM
Citation Segall, YQuistad, GBNomura, DKCasida, JE Arachidonylsulfonyl derivatives as cannabinoid CB1 receptor and fatty acid amide hydrolase inhibitors. Bioorg Med Chem Lett13:3301-3 (2003) Fatty-acid amide hydrolase 1
Name:Fatty-acid amide hydrolase 1
Type:Hydrolase; single-pass membrane protein; homodimer
Mol. Mass.:63227.28
Organism:Mus musculus (mouse)
Description:Mouse brain membranes were used in the assay.
Residue:579
BDBM50132715
NameBDBM50132715
Synonyms:CHEMBL97038 dodecane-1-sulfonyl fluoride
TypeSmall organic molecule
Emp. Form.C12H25FO2S
Mol. Mass.252.389
SMILESCCCCCCCCCCCCS(F)(=O)=O