Reaction Details
TargetCannabinoid receptor 1
LigandBDBM50132717
Substrate/Competitorn/a
Meas. Tech.ChEBML_46474
IC50 1.8±n/a nM
Citation Segall, YQuistad, GBNomura, DKCasida, JE Arachidonylsulfonyl derivatives as cannabinoid CB1 receptor and fatty acid amide hydrolase inhibitors. Bioorg Med Chem Lett13:3301-3 (2003) Cannabinoid receptor 1
Name:Cannabinoid receptor 1
Type:Enzyme
Mol. Mass.:52842.52
Organism:Mus musculus (Mouse)
Description:P47746
Residue:473
BDBM50132717
NameBDBM50132717
Synonyms:CHEMBL333149 isopropyl dodecylphosphonofluoridate | isopropyl dodecylphosphonofluoridoate
TypeSmall organic molecule
Emp. Form.C15H32FO2P
Mol. Mass.294.3855
SMILESCCCCCCCCCCCCP(F)(=O)OC(C)C