Reaction Details
TargetCannabinoid receptor 1
LigandBDBM50132715
Substrate/Competitorn/a
Meas. Tech.ChEBML_46623
IC50 18±n/a nM
Citation Segall, YQuistad, GBNomura, DKCasida, JE Arachidonylsulfonyl derivatives as cannabinoid CB1 receptor and fatty acid amide hydrolase inhibitors. Bioorg Med Chem Lett13:3301-3 (2003) Cannabinoid receptor 1
Name:Cannabinoid receptor 1
Type:G Protein-Coupled Receptor (GPCR)
Mol. Mass.:52856.55
Organism:Rattus norvegicus (rat)
Description:P20272
Residue:473
BDBM50132715
NameBDBM50132715
Synonyms:CHEMBL97038 dodecane-1-sulfonyl fluoride
TypeSmall organic molecule
Emp. Form.C12H25FO2S
Mol. Mass.252.389
SMILESCCCCCCCCCCCCS(F)(=O)=O