Reaction Details
TargetPlasminogen activator inhibitor 1
LigandBDBM50132875
Substrate/Competitorn/a
Meas. Tech.ChEBML_155612
IC50 1200±n/a nM
Citation Ye, BBauer, SBuckman, BOGhannam, AGriedel, BDKhim, SKLee, WSacchi, KLShaw, KJLiang, AWu, QZhao, Z Synthesis and biological evaluation of menthol-based derivatives as inhibitors of plasminogen activator inhibitor-1 (PAI-1). Bioorg Med Chem Lett13:3361-5 (2003) Plasminogen activator inhibitor 1
Name:Plasminogen activator inhibitor 1
Type:Enzyme
Mol. Mass.:45064.00
Organism:Homo sapiens (Human)
Description:P05121
Residue:402
BDBM50132875
NameBDBM50132875
Synonyms:2-{2-[(4-{[2-((1R,2S,5R)-2-Isopropyl-5-methyl-cyclohexyloxy)-acetylamino]-methyl}-phenylamino)-methyl]-6-methoxy-phenoxy}-5-nitro-benzoic acid | CHEMBL112371
TypeSmall organic molecule
Emp. Form.C34H41N3O8
Mol. Mass.619.7046
SMILESCOc1cccc(CNc2ccc(CNC(=O)CO[C@@H]3C[C@H](C)CC[C@H]3C(C)C)cc2)c1Oc1ccc(cc1C(O)=O)[N+]([O-])=O