Reaction Details
TargetCorticotropin-releasing factor receptor 1
LigandBDBM50132902
Substrate/Competitorn/a
Meas. Tech.ChEBML_51133
Ki 2.1±n/a nM
Citation Wilcoxen, KHuang, CQMcCarthy, JRGrigoriadis, DEChen, C Synthesis of 3-phenylpyrazolo[4,3-b]pyridines via a convenient synthesis of 4-amino-3-arylpyrazoles and SAR of corticotropin-releasing factor receptor type-1 antagonists. Bioorg Med Chem Lett13:3367-70 (2003) Corticotropin-releasing factor receptor 1
Name:Corticotropin-releasing factor receptor 1
Type:Enzyme
Mol. Mass.:50744.31
Organism:Homo sapiens (Human)
Description:P34998
Residue:444
BDBM50132902
NameBDBM50132902
Synonyms:CHEMBL114861 | Dibutyl-[3-(2,4-dichloro-phenyl)-1-ethyl-5-methyl-1H-pyrazolo[4,3-b]pyridin-7-yl]-amine
TypeSmall organic molecule
Emp. Form.C23H30Cl2N4
Mol. Mass.433.417
SMILESCCCCN(CCCC)c1cc(C)nc2c(nn(CC)c12)-c1ccc(Cl)cc1Cl