Reaction Details
TargetCorticotropin-releasing factor receptor 1
LigandBDBM50132921
Substrate/Competitorn/a
Meas. Tech.ChEBML_51134
Ki 1.3±n/a nM
Citation Huang, CQWilcoxen, KMcCarthy, JRHaddach, MGrigoriadis, DChen, C Synthesis of 1-methyl-3-phenylpyrazolo[4,3-b]pyridines via a methylation of 4-phthalimino-3-phenylpyrazoles and optimization toward highly potent corticotropin-releasing factor type-1 antagonists. Bioorg Med Chem Lett13:3371-4 (2003) Corticotropin-releasing factor receptor 1
Name:Corticotropin-releasing factor receptor 1
Type:Enzyme
Mol. Mass.:50744.31
Organism:Homo sapiens (Human)
Description:P34998
Residue:444
BDBM50132921
NameBDBM50132921
Synonyms:CHEMBL112626 | [3-(2,4-Dichloro-phenyl)-1,5-dimethyl-1H-pyrazolo[4,3-b]pyridin-7-yl]-ethyl-pentyl-amine
TypeSmall organic molecule
Emp. Form.C21H26Cl2N4
Mol. Mass.405.364
SMILESCCCCCN(CC)c1cc(C)nc2c(nn(C)c12)-c1ccc(Cl)cc1Cl