Reaction Details
TargetCorticotropin-releasing factor receptor 1
LigandBDBM50132950
Substrate/Competitorn/a
Meas. Tech.ChEBML_51134
Ki 0.900000±n/a nM
Citation Huang, CQWilcoxen, KMcCarthy, JRHaddach, MGrigoriadis, DChen, C Synthesis of 1-methyl-3-phenylpyrazolo[4,3-b]pyridines via a methylation of 4-phthalimino-3-phenylpyrazoles and optimization toward highly potent corticotropin-releasing factor type-1 antagonists. Bioorg Med Chem Lett13:3371-4 (2003) Corticotropin-releasing factor receptor 1
Name:Corticotropin-releasing factor receptor 1
Type:Enzyme
Mol. Mass.:50744.31
Organism:Homo sapiens (Human)
Description:P34998
Residue:444
BDBM50132950
NameBDBM50132950
Synonyms:Butyl-[3-(2,4-dichloro-phenyl)-1,5-dimethyl-1H-pyrazolo[4,3-b]pyridin-7-yl]-pentyl-amine | CHEMBL114912
TypeSmall organic molecule
Emp. Form.C23H30Cl2N4
Mol. Mass.433.417
SMILESCCCCCN(CCCC)c1cc(C)nc2c(nn(C)c12)-c1ccc(Cl)cc1Cl