Reaction Details
TargetCorticotropin-releasing factor receptor 1
LigandBDBM50132952
Substrate/Competitorn/a
Meas. Tech.ChEMBL_51117 (CHEMBL664963)
Ki 5.7±n/a nM
Citation Huang, CQWilcoxen, KMcCarthy, JRHaddach, MWebb, TRGu, JXie, YFGrigoriadis, DEChen, C Synthesis and SAR of 8-arylquinolines as potent corticotropin-releasing factor1 (CRF1) receptor antagonists. Bioorg Med Chem Lett13:3375-9 (2003) Corticotropin-releasing factor receptor 1
Name:Corticotropin-releasing factor receptor 1
Type:Enzyme
Mol. Mass.:50744.31
Organism:Homo sapiens (Human)
Description:P34998
Residue:444
BDBM50132952
NameBDBM50132952
Synonyms:CHEMBL325430 | [8-(2,4-Dichloro-phenyl)-2-methyl-quinolin-4-yl]-bis-(2-methoxy-ethyl)-amine
TypeSmall organic molecule
Emp. Form.C22H24Cl2N2O2
Mol. Mass.419.344
SMILESCOCCN(CCOC)c1cc(C)nc2c(cccc12)-c1ccc(Cl)cc1Cl