Reaction Details
TargetAmine oxidase [flavin-containing] B
LigandBDBM50568282
Substrate/Competitorn/a
Meas. Tech.ChEMBL_2105006 (CHEMBL4813509)
Ki 1.5±n/a nM
Citation Takao, KTakemura, YNagai, JKamauchi, HHoshi, KMabashi, RUesawa, YSugita, Y Synthesis and biological evaluation of 3-styrylchromone derivatives as selective monoamine oxidase B inhibitors. Bioorg Med Chem42:0 (2021) 
 
Amine oxidase [flavin-containing] B
Name:Amine oxidase [flavin-containing] B
Type:Protein
Mol. Mass.:58768.76
Organism:Homo sapiens (Human)
Description:P27338
Residue:520
BDBM50568282
NameBDBM50568282
Synonyms:CHEMBL4847545
TypeSmall organic molecule
Emp. Form.C18H13ClO3
Mol. Mass.312.747
SMILESCOc1ccc2c(c1)occ(\C=C\c1ccc(Cl)cc1)c2=O