Reaction Details
TargetMu-type opioid receptor
LigandBDBM50133051
Substrate/Competitorn/a
Meas. Tech.ChEMBL_148870 (CHEMBL753748)
Ki 13.7±n/a nM
Citation Vig, BSZheng, MQMurray, TFAldrich, JV Effects of the substitution of Phe4 in the opioid peptide [D-Ala8]dynorphin A-(1-11)NH2. J Med Chem46:4002-8 (2003) 
 
Mu-type opioid receptor
Name:Mu-type opioid receptor
Type:G Protein-Coupled Receptor (GPCR)
Mol. Mass.:44503.11
Organism:Rattus norvegicus (rat)
Description:Competition binding assays were carried out using membrane preparations from transfected HN9.10 cells that constitutively expressed the mu opioid receptor.
Residue:398
BDBM50133051
NameBDBM50133051
Synonyms:CHEMBL413832 | Opioid Peptide [d-Ala(8)]Dynorphin derivative
TypeSmall organic molecule
Emp. Form.C61H100N22O12
Mol. Mass.1333.5869
SMILESCC(C)C[C@H](NC(=O)[C@@H](CCc1ccccc1)NC(=O)CNC(=O)CNC(=O)[C@@H](N)Cc1ccc(O)cc1)C(=O)N[C@@H](CCCNC(N)=N)C(=O)N[C@@H](CCCNC(N)=N)C(=O)N[C@H](C)C(=O)N[C@@H](CCCNC(N)=N)C(=O)N1CCC[C@H]1C(=O)N[C@@H](CCCCN)C(N)=O