Reaction Details
TargetKappa-type opioid receptor
LigandBDBM50133053
Substrate/Competitorn/a
Meas. Tech.ChEMBL_145817 (CHEMBL873914)
Ki 0.11±n/a nM
Citation Vig, BSZheng, MQMurray, TFAldrich, JV Effects of the substitution of Phe4 in the opioid peptide [D-Ala8]dynorphin A-(1-11)NH2. J Med Chem46:4002-8 (2003) 
 
Kappa-type opioid receptor
Name:Kappa-type opioid receptor
Type:G Protein-Coupled Receptor (GPCR)
Mol. Mass.:42692.90
Organism:Rattus norvegicus (rat)
Description:P34975
Residue:380
BDBM50133053
NameBDBM50133053
Synonyms:CHEMBL405057 | Opioid Peptide [d-Ala(8)]Dynorphin derivative
TypeSmall organic molecule
Emp. Form.C60H98N22O12
Mol. Mass.1319.5603
SMILESCC(C)C[C@H](NC(=O)[C@@H](Cc1ccccc1)NC(=O)CNC(=O)CNC(=O)[C@@H](N)Cc1ccc(O)cc1)C(=O)N[C@@H](CCCNC(N)=N)C(=O)N[C@@H](CCCNC(N)=N)C(=O)N[C@H](C)C(=O)N[C@@H](CCCNC(N)=N)C(=O)N1CCC[C@H]1C(=O)N[C@@H](CCCCN)C(N)=O