Reaction Details
TargetD(2) dopamine receptor
LigandBDBM50026553
Substrate/Competitorn/a
Meas. Tech.ChEMBL_62879 (CHEMBL878289)
Ki 3±n/a nM
Citation Venhuis, BJDijkstra, DWustrow, DMeltzer, LTWise, LDJohnson, SJWikström, HV Orally active oxime derivatives of the dopaminergic prodrug 6-(N,N-di-n-propylamino)-3,4,5,6,7,8-hexahydro-2H-naphthalen-1-one. Synthesis and pharmacological activity. J Med Chem46:4136-40 (2003) 
 
D(2) dopamine receptor
Name:D(2) dopamine receptor
Type:G Protein-Coupled Receptor (GPCR)
Mol. Mass.:50931.60
Organism:Rattus norvegicus (rat)
Description:P61169
Residue:444
BDBM50026553
NameBDBM50026553
Synonyms:(+)-6-Dipropylamino-5,6,7,8-tetrahydro-naphthalene-1,2-diol (-)-6-Dipropylamino-5,6,7,8-tetrahydro-naphthalene-1,2-diol 6-Dipropylamino-5,6,7,8-tetrahydro-naphthalene-1,2-diol (DP-5,6-ADTN) | CHEMBL11845
TypeSmall organic molecule
Emp. Form.C16H25NO2
Mol. Mass.263.3752
SMILESCCCN(CCC)C1CCc2c(C1)ccc(O)c2O