Reaction Details
TargetProtein kinase C delta type
LigandBDBM50133238
Substrate/Competitorn/a
Meas. Tech.ChEMBL_160777 (CHEMBL766317)
Ki 0.36±n/a nM
Citation Sridhar, JWei, ZLNowak, ILewin, NEAyres, JAPearce, LVBlumberg, PMKozikowski, AP New bivalent PKC ligands linked by a carbon spacer: enhancement in binding affinity. J Med Chem46:4196-204 (2003) 
 
Protein kinase C delta type
Name:Protein kinase C delta type
Type:PROTEIN
Mol. Mass.:77554.99
Organism:Mus musculus
Description:ChEMBL_1351519
Residue:674
BDBM50133238
NameBDBM50133238
Synonyms:CHEMBL334853 | Hexadecanedioic acid ((S)-5-hydroxymethyl-2-isopropyl-1-methyl-3-(S)-oxo-1,2,3,4,5,6-hexahydro-benzo[e][1,4]diazocin-8-yl)-amide ((S)-5-hydroxymethyl-2-isopropyl-1-(S)-methyl-3-oxo-1,2,3,4,5,6-hexahydro-benzo[e][1,4]diazocin-9-yl)-amide
TypeSmall organic molecule
Emp. Form.C46H72N6O6
Mol. Mass.805.1005
SMILESCC(C)[C@@H]1N(C)c2ccc(NC(=O)CCCCCCCCCCCCCCC(=O)Nc3ccc4C[C@@H](CO)NC(=O)[C@H](C(C)C)N(C)c4c3)cc2C[C@@H](CO)NC1=O