Reaction Details
TargetProtein kinase C alpha type
LigandBDBM50133239
Substrate/Competitorn/a
Meas. Tech.ChEMBL_162571 (CHEMBL768513)
Ki 7860±n/a nM
Citation Sridhar, JWei, ZLNowak, ILewin, NEAyres, JAPearce, LVBlumberg, PMKozikowski, AP New bivalent PKC ligands linked by a carbon spacer: enhancement in binding affinity. J Med Chem46:4196-204 (2003) 
 
Protein kinase C alpha type
Name:Protein kinase C alpha type
Type:Enzyme
Mol. Mass.:76842.76
Organism:Bos taurus (bovine)
Description:n/a
Residue:672
BDBM50133239
NameBDBM50133239
Synonyms:CHEMBL334451 | N-(5-Hydroxymethyl-2-isopropyl-1-methyl-3-oxo-1,2,3,4,5,6-hexahydro-benzo[e][1,4]diazocin-9-yl)-2-(2-{2-[2-(2-N-(5-Hydroxymethyl-2-isopropyl-1-methyl-3-oxo-1,2,3,4,5,6-hexahydro-benzo[e][1,4]diazocin-9-yl)carbamoylmethoxy-ethoxy)-ethoxy]-ethoxy}-ethoxy)-acetamide
TypeSmall organic molecule
Emp. Form.C42H64N6O11
Mol. Mass.828.9912
SMILESCC(C)[C@@H]1N(C)c2ccc(NC(=O)COCCOCCOCCOCCOCC(=O)Nc3ccc4C[C@@H](CO)NC(=O)[C@H](C(C)C)N(C)c4c3)cc2C[C@@H](CO)NC1=O