Reaction Details
TargetProtein kinase C alpha type
LigandBDBM50133235
Substrate/Competitorn/a
Meas. Tech.ChEMBL_162571 (CHEMBL768513)
Ki 2.4±n/a nM
Citation Sridhar, JWei, ZLNowak, ILewin, NEAyres, JAPearce, LVBlumberg, PMKozikowski, AP New bivalent PKC ligands linked by a carbon spacer: enhancement in binding affinity. J Med Chem46:4196-204 (2003) 
 
Protein kinase C alpha type
Name:Protein kinase C alpha type
Type:Enzyme
Mol. Mass.:76842.76
Organism:Bos taurus (bovine)
Description:n/a
Residue:672
BDBM50133235
NameBDBM50133235
Synonyms:CHEMBL132720 | Docosanedioic acid ((S)-5-hydroxymethyl-2-isopropyl-1-methyl-3-(S)-oxo-1,2,3,4,5,6-hexahydro-benzo[e][1,4]diazocin-8-yl)-amide ((S)-5-hydroxymethyl-2-isopropyl-1-(S)-methyl-3-oxo-1,2,3,4,5,6-hexahydro-benzo[e][1,4]diazocin-9-yl)-amide
TypeSmall organic molecule
Emp. Form.C52H84N6O6
Mol. Mass.889.26
SMILESCC(C)[C@@H]1N(C)c2ccc(NC(=O)CCCCCCCCCCCCCCCCCCCCC(=O)Nc3ccc4C[C@@H](CO)NC(=O)[C@H](C(C)C)N(C)c4c3)cc2C[C@@H](CO)NC1=O