Reaction Details
TargetAdenosine receptor A1
LigandBDBM50051234
Substrate/Competitorn/a
Meas. Tech.ChEMBL_27900 (CHEMBL640560)
Ki 1±n/a nM
Citation Pastorin, GDa Ros, TSpalluto, GDeflorian, FMoro, SCacciari, BBaraldi, PGGessi, SVarani, KBorea, PA Pyrazolo[4,3-e]-1,2,4-triazolo[1,5-c]pyrimidine derivatives as adenosine receptor antagonists. Influence of the N5 substituent on the affinity at the human A 3 and A 2B adenosine receptor subtypes: a molecular modeling investigation. J Med Chem46:4287-96 (2003) 
 
Adenosine receptor A1
Name:Adenosine receptor A1
Type:G Protein-Coupled Receptor (GPCR)
Mol. Mass.:36520.92
Organism:Homo sapiens (Human)
Description:P30542
Residue:326
BDBM50051234
NameBDBM50051234
Synonyms:2-(furan-2-yl)-8-phenethyl-8H-pyrazolo[4,3-e][1,2,4]triazolo[1,5-c]pyrimidin-5-amine CHEMBL16867 | N-[2-Furan-2-yl-8-(3-phenyl-propyl)-2,8-dihydro-3H-pyrazolo[4,3-e][1,2,4]triazolo[1,5-c]pyrimidin-5-yl]-2-phenoxy-acetamide
TypeSmall organic molecule
Emp. Form.C18H15N7O
Mol. Mass.345.358
SMILESNc1nc2nn(CCc3ccccc3)cc2c2nc(nn12)-c1ccco1