Reaction Details
TargetDual specificity mitogen-activated protein kinase kinase 4
LigandBDBM50396483
Substrate/Competitorn/a
Meas. Tech.ChEMBL_2105912 (CHEMBL4814587)
Kd 8.2±n/a nM
Citation Klövekorn, PPfaffenrot, BJuchum, MSelig, RAlbrecht, WZender, LLaufer, SA From off-to on-target: New BRAF-inhibitor-template-derived compounds selectively targeting mitogen activated protein kinase kinase 4 (MKK4). Eur J Med Chem210:0 (2021) 
 
Dual specificity mitogen-activated protein kinase kinase 4
Name:Dual specificity mitogen-activated protein kinase kinase 4
Type:PROTEIN
Mol. Mass.:44120.14
Organism:Mus musculus
Description:EBI_11048
Residue:397
BDBM50396483
NameBDBM50396483
Synonyms:PLX-4032 Ro 5185426 US11332479, Compound Vemurafenib US9388165, Reference, Vemurafenib (PLX-4032) VEMURAFENIB
TypeSmall organic molecule
Emp. Form.C23H18ClF2N3O3S
Mol. Mass.489.922
SMILESCCCS(=O)(=O)Nc1ccc(F)c(C(=O)c2c[nH]c3ncc(cc23)-c2ccc(Cl)cc2)c1F