Reaction Details
TargetPancreatic alpha-amylase
LigandBDBM23406
Substrate/Competitorn/a
Meas. Tech.ChEMBL_2105998 (CHEMBL4814673)
IC50 1660±n/a nM
Citation Patel, OPSJesumoroti, OJLegoabe, LJBeteck, RM Metronidazole-conjugates: A comprehensive review of recent developments towards synthesis and medicinal perspective. Eur J Med Chem210:0 (2021) 
 
Pancreatic alpha-amylase
Name:Pancreatic alpha-amylase
Type:Protein
Mol. Mass.:57088.07
Organism:Sus scrofa (Pig)
Description:P00690
Residue:511
BDBM23406
NameBDBM23406
Synonyms:(3R,4R,5S,6R)-5-{[(2R,3R,4R,5S,6R)-5-{[(2R,3R,4S,5S,6R)-3,4-dihydroxy-6-methyl-5-{[(1S,4R,5S,6S)-4,5,6-trihydroxy-3-(hydroxymethyl)cyclohex-2-en-1-yl]amino}oxan-2-yl]oxy}-3,4-dihydroxy-6-(hydroxymethyl)oxan-2-yl]oxy}-6-(hydroxymethyl)oxane-2,3,4-triol US11292789, Acarbose
TypeCarbohydrate
Emp. Form.C25H43NO18
Mol. Mass.645.6048
SMILESC[C@H]1O[C@H](O[C@@H]2[C@@H](CO)O[C@H](O[C@@H]3[C@@H](CO)OC(O)[C@H](O)[C@H]3O)[C@H](O)[C@H]2O)[C@H](O)[C@@H](O)[C@@H]1N[C@H]1C=C(CO)[C@@H](O)[C@H](O)[C@H]1O