Reaction Details
Target5-hydroxytryptamine receptor 1D
LigandBDBM50133452
Substrate/Competitorn/a
Meas. Tech.ChEMBL_1718 (CHEMBL616924)
Ki 0.76±n/a nM
Citation Egle, IMacLean, NDemchyshyn, LEdwards, LSlassi, ATehim, A (R)-3-(N-methylpyrrolidin-2-ylmethyl)-5-(1,2,3,6-tetrahydropyridin-4-yl)-1H-indole derivatives as high affinity h5-HT1B/1D ligands. Bioorg Med Chem Lett13:3419-21 (2003) 5-hydroxytryptamine receptor 1D
Name:5-hydroxytryptamine receptor 1D
Type:G Protein-Coupled Receptor (GPCR)
Mol. Mass.:41920.63
Organism:Homo sapiens (Human)
Description:Receptor binding assays were performed using human clone stably expressed in CHO cells.
Residue:377
BDBM50133452
NameBDBM50133452
Synonyms:5-[1-(4-Methoxy-benzenesulfonyl)-1,2,3,6-tetrahydro-pyridin-4-yl]-3-((R)-1-methyl-pyrrolidin-2-ylmethyl)-1H-indole | CHEMBL115941
TypeSmall organic molecule
Emp. Form.C26H31N3O3S
Mol. Mass.465.608
SMILESCOc1ccc(cc1)S(=O)(=O)N1CCC(=CC1)c1ccc2[nH]cc(C[C@H]3CCCN3C)c2c1