Reaction Details
Target5-hydroxytryptamine receptor 1B
LigandBDBM50133457
Substrate/Competitorn/a
Meas. Tech.ChEMBL_1349 (CHEMBL616534)
Ki 4.2±n/a nM
Citation Egle, IMacLean, NDemchyshyn, LEdwards, LSlassi, ATehim, A (R)-3-(N-methylpyrrolidin-2-ylmethyl)-5-(1,2,3,6-tetrahydropyridin-4-yl)-1H-indole derivatives as high affinity h5-HT1B/1D ligands. Bioorg Med Chem Lett13:3419-21 (2003) 5-hydroxytryptamine receptor 1B
Name:5-hydroxytryptamine receptor 1B
Type:G Protein-Coupled Receptor (GPCR)
Mol. Mass.:43579.17
Organism:Homo sapiens (Human)
Description:Receptor binding assays were performed using human clone stably expressed in CHO cells
Residue:390
BDBM50133457
NameBDBM50133457
Synonyms:4-[3-((R)-1-Methyl-pyrrolidin-2-ylmethyl)-1H-indol-5-yl]-3,6-dihydro-2H-pyridine-1-carboxylic acid (4-methoxy-phenyl)-amide | CHEMBL431866
TypeSmall organic molecule
Emp. Form.C27H32N4O2
Mol. Mass.444.5686
SMILESCOc1ccc(NC(=O)N2CCC(=CC2)c2ccc3[nH]cc(C[C@H]4CCCN4C)c3c2)cc1