Reaction Details
Target5-hydroxytryptamine receptor 1D
LigandBDBM50005835
Substrate/Competitorn/a
Meas. Tech.ChEMBL_1718 (CHEMBL616924)
Ki 3.4±n/a nM
Citation Egle, IMacLean, NDemchyshyn, LEdwards, LSlassi, ATehim, A (R)-3-(N-methylpyrrolidin-2-ylmethyl)-5-(1,2,3,6-tetrahydropyridin-4-yl)-1H-indole derivatives as high affinity h5-HT1B/1D ligands. Bioorg Med Chem Lett13:3419-21 (2003) 5-hydroxytryptamine receptor 1D
Name:5-hydroxytryptamine receptor 1D
Type:G Protein-Coupled Receptor (GPCR)
Mol. Mass.:41920.63
Organism:Homo sapiens (Human)
Description:Receptor binding assays were performed using human clone stably expressed in CHO cells.
Residue:377
BDBM50005835
NameBDBM50005835
Synonyms:(3-[2-(dimethylamino)ethyl]-1H-indol-5-yl)-N-methylmethanesulfonamide 1-{3-[2-(dimethylamino)ethyl]-1H-indol-5-yl}-N-methylmethanesulfonamide 3-[2-(dimethylamino)ethyl]-N-methylindole-5-methanesulfonamide SUMATRIPTAN Sumax
TypeSmall organic molecule
Emp. Form.C14H21N3O2S
Mol. Mass.295.4
SMILESCNS(=O)(=O)Cc1ccc2[nH]cc(CCN(C)C)c2c1