Reaction Details
TargetBeta-galactosidase
LigandBDBM50133503
Substrate/Competitorn/a
Meas. Tech.ChEMBL_37271 (CHEMBL656021)
IC50 2400±n/a nM
Citation Ogawa, SFujieda, SSakata, YIshizaki, MHisamatsu, SOkazaki, K Synthesis and glycosidase inhibitory activity of some N-substituted 6-deoxy-5a-carba-beta-DL- and L-galactopyranosylamines. Bioorg Med Chem Lett13:3461-3 (2003) Beta-galactosidase
Name:Beta-galactosidase
Type:Protein
Mol. Mass.:73420.88
Organism:Bos taurus (Bovine)
Description:n/a
Residue:653
BDBM50133503
NameBDBM50133503
Synonyms:(1R,3R,6S)-4-Methyl-6-(4-phenyl-butylamino)-cyclohexane-1,2,3-triol | CHEMBL323939
TypeSmall organic molecule
Emp. Form.C17H27NO3
Mol. Mass.293.4012
SMILESCC1C[C@H](NCCCCc2ccccc2)[C@@H](O)C(O)[C@@H]1O