Reaction Details
TargetBeta-galactosidase
LigandBDBM50118923
Substrate/Competitorn/a
Meas. Tech.ChEMBL_37271 (CHEMBL656021)
IC50 700±n/a nM
Citation Ogawa, SFujieda, SSakata, YIshizaki, MHisamatsu, SOkazaki, K Synthesis and glycosidase inhibitory activity of some N-substituted 6-deoxy-5a-carba-beta-DL- and L-galactopyranosylamines. Bioorg Med Chem Lett13:3461-3 (2003) Beta-galactosidase
Name:Beta-galactosidase
Type:Protein
Mol. Mass.:73420.88
Organism:Bos taurus (Bovine)
Description:n/a
Residue:653
BDBM50118923
NameBDBM50118923
Synonyms:(1S,2S,3R)-4-Methyl-6-octylamino-cyclohexane-1,2,3-triol CHEMBL314757
TypeSmall organic molecule
Emp. Form.C15H31NO3
Mol. Mass.273.4115
SMILESCCCCCCCCNC1CC(C)C(O)C(O)C1O