Reaction Details
TargetBeta-galactosidase
LigandBDBM50133507
Substrate/Competitorn/a
Meas. Tech.ChEMBL_37271 (CHEMBL656021)
IC50 200±n/a nM
Citation Ogawa, SFujieda, SSakata, YIshizaki, MHisamatsu, SOkazaki, K Synthesis and glycosidase inhibitory activity of some N-substituted 6-deoxy-5a-carba-beta-DL- and L-galactopyranosylamines. Bioorg Med Chem Lett13:3461-3 (2003) Beta-galactosidase
Name:Beta-galactosidase
Type:Protein
Mol. Mass.:73420.88
Organism:Bos taurus (Bovine)
Description:n/a
Residue:653
BDBM50133507
NameBDBM50133507
Synonyms:4-Decylamino-6-methyl-cyclohexane-1,2,3-triol | CHEMBL117074
TypeSmall organic molecule
Emp. Form.C17H35NO3
Mol. Mass.301.4647
SMILESCCCCCCCCCCNC1CC(C)C(O)C(O)C1O